FINANCIAL_MONTH,FINANCIAL_YEAR,ORGANISATION_IDENTIFIER_(CODE_OF_PROVIDER),ORGANISATION_SITE_IDENTIFIER_(OF_TREATMENT),ORGANISATION_IDENTIFIER_(CODE_OF_COMMISSIONER),ACTIVITY_TREATMENT_FUNCTION_CODE,CLINICAL_INTERVENTION_DATE_(DRUG_DISPENSED),THERAPEUTIC_INDICATION_CODE_(SNOMED_CT),DRUG_NAME_(HIGH_COST_TARIFF_EXCLUDED_DRUG),ROUTE_OF_ADMINISTRATION_(SNOMED_CT_DM+D),DRUG_STRENGTH_(HIGH_COST_TARIFF_EXCLUDED_DRUG),DRUG_VOLUME_(HIGH_COST_TARIFF_EXCLUDED_DRUG),DRUG_PACK_SIZE_(HIGH_COST_TARIFF_EXCLUDED_DRUG),DRUG_QUANTITY_OR_WEIGHT_PROPORTION_(HIGH_COST_TARIFF_EXCLUDED_DRUG),UNIT_OF_MEASUREMENT_(SNOMED_CT_DM+D),DISPENSING_ROUTE_(HIGH_COST_TARIFF_EXCLUDED_DRUG),PROVIDER_REFERENCE_NUMBER,COMMISSIONED_SERVICE_CATEGORY_CODE,SERVICE_CODE,NATIONAL_CANCER_DRUGS_FUND_FORM_CODE,LOCAL_CONTRACT_MONITORING_CODE,LOCAL_CONTRACT_MONITORING_DESCRIPTION,CONTRACT_MONITORING_ADDITIONAL_DETAIL_(FIRST),CONTRACT_MONITORING_ADDITIONAL_DESCRIPTION_(FIRST),UNIT_PRICE_(SUPPLIER),VALUE_ADDED_TAX_CHARGED_INDICATOR_(CONTRACT_MONITORING)
1,202223,RXR,RXR01,27T,370,22/04/2022,,PEMBROLIZUMAB,47625008,100MG,4ML,1,2,415818006,1,0,21,NCBPS01C,,,,,,1380.76,Y
1,202223,RXR,RXR01,27T,303,28/04/2022,,HYDROXYCARBAMIDE,26643006,500MG,,100,0.6,428641000,3,0,21,NCBPS01C,,,,,,0.1,N
1,202223,RXR,RXR01,27T,370,27/04/2022,,PACLITAXEL,47625008,30MG,5ML,1,1,415818006,1,0,21,NCBPS01C,,,,,,6.24,Y
1,202223,RXR,RXR01,27T,370,16/04/2022,,PACLITAXEL,47625008,30MG,5ML,1,1,415818006,1,0,21,NCBPS01C,,,,,,6.24,Y
1,202223,RXR,RXR01,27T,370,04/04/2022,,PACLITAXEL,47625008,30MG,5ML,1,1,415818006,1,0,21,NCBPS01C,,,,,,6.24,Y
1,202223,RXR,RXR01,27T,370,27/04/2022,,FLUOROURACIL,47625008,600MG,24ML,1,1,415818006,2,0,21,NCBPS01C,,,,,,15.06,Y
1,202223,RXR,RXR01,27T,370,11/04/2022,,FLUOROURACIL,47625008,600MG,24ML,1,1,415818006,2,0,21,NCBPS01C,,,,,,15.06,Y
1,202223,RXR,RXR01,27T,370,11/04/2022,,FLUOROURACIL,47625008,5000MG,115ML,1,1,1.06961E+16,2,0,21,NCBPS01C,,,,,,64.46,Y
1,202223,RXR,RXR01,27T,370,27/04/2022,,FLUOROURACIL,47625008,5000MG,115ML,1,1,1.06961E+16,2,0,21,NCBPS01C,,,,,,64.46,Y
1,202223,RXR,RXR01,27T,370,22/04/2022,,VINORELBINE,26643006,20MG,,1,2,428641000,3,0,21,NCBPS01C,,,,,,23.96,N
1,202223,RXR,RXR01,27T,370,22/04/2022,,CARBOPLATIN,47625008,400MG,540ML,1,1,428672001,1,0,21,NCBPS01C,,,,,,39.8,Y
1,202223,RXR,RXR01,27T,370,13/04/2022,,FLUOROURACIL,6064005,5%,,1,1,258682000,3,0,21,NCBPS01C,,,,,,32.37,N
1,202223,RXR,RXR01,27T,370,14/04/2022,,CARBOPLATIN,47625008,600MG,60ML,1,1,415818006,1,0,21,NCBPS01C,,,,,,23.38,Y
1,202223,RXR,RXR01,27T,370,14/04/2022,,CARBOPLATIN,47625008,150MG,15ML,1,1,415818006,1,0,21,NCBPS01C,,,,,,7.18,Y
1,202223,RXR,RXR01,27T,370,21/04/2022,,ETOPOSIDE,26643006,50MG,,20,0.1,428641000,3,0,21,NCBPS01C,,,,,,4.99,N
1,202223,RXR,RXR01,27T,370,07/04/2022,,ETOPOSIDE,26643006,50MG,,20,0.7,428641000,3,0,21,NCBPS01C,,,,,,4.99,N
1,202223,RXR,RXR01,27T,370,26/04/2022,,FLUOROURACIL,47625008,600MG,24ML,1,1,415818006,2,0,21,NCBPS01C,,,,,,15.06,Y
1,202223,RXR,RXR01,27T,370,13/04/2022,,FLUOROURACIL,47625008,600MG,24ML,1,1,415818006,2,0,21,NCBPS01C,,,,,,15.06,Y
1,202223,RXR,RXR01,27T,370,26/04/2022,,FLUOROURACIL,47625008,5000MG,100ML,1,1,415818006,1,0,21,NCBPS01C,,,,,,12,Y
1,202223,RXR,RXR01,27T,370,13/04/2022,,FLUOROURACIL,47625008,5000MG,100ML,1,1,415818006,1,0,21,NCBPS01C,,,,,,12,Y
1,202223,RXR,RXR01,27T,370,21/04/2022,,FLUOROURACIL,47625008,5000MG,100ML,1,1,415818006,1,0,21,NCBPS01C,,,,,,12,Y
1,202223,RXR,RXR01,27T,800,22/04/2022,,CARBOPLATIN,47625008,150MG,15ML,1,2,415818006,1,0,21,NCBPS01C,,,,,,7.18,Y
1,202223,RXR,RXR01,27T,303,29/04/2022,,NILOTINIB,26643006,150MG,,112,1,428641000,3,0,21,NCBPS01C,,,,,,14.37,N
1,202223,RXR,RXR02,27T,370,01/04/2022,,FLUOROURACIL,6064005,5%,,1,1,258682000,3,0,21,NCBPS01C,,,,,,32.37,N
1,202223,RXR,RXR01,27T,303,01/04/2022,,VINCRISTINE,47625008,2MG,2,1,1,415818006,1,0,21,NCBPS01C,,,,,,9.92,Y
1,202223,RXR,RXR01,27T,370,19/04/2022,,ATEZOLIZUMAB,47625008,1200MG,20ML,1,1,415818006,1,10064524,21,NCBPS01C,,,,,,1256.53,Y
1,202223,RXR,RXR01,27T,370,19/04/2022,,ETOPOSIDE,26643006,50MG,,20,0.1,428641000,3,0,21,NCBPS01C,,,,,,4.99,N
1,202223,RXR,RXR02,27T,303,25/04/2022,,NORMAL IMMUNOGLOBULIN HUMAN,372461007,2500MG,25ML,1,1,415818006,2,0,21,NCBPS16X,,,,,,152.4,Y
1,202223,RXR,RXR01,27T,303,01/04/2022,,IBRUTINIB,26643006,420MG,,28,1,428641000,3,3102894,21,NCBPS01C,,,,,,96.58,N
1,202223,RXR,RXR01,27T,303,28/04/2022,,IBRUTINIB,26643006,420MG,,28,1,428641000,3,3102894,21,NCBPS01C,,,,,,96.58,N
1,202223,RXR,RXR01,27T,303,08/04/2022,,HYDROXYCARBAMIDE,26643006,500MG,,100,0.88,428641000,3,0,21,NCBPS01C,,,,,,0.1,N
1,202223,RXR,RXR01,27T,800,06/04/2022,,TRASTUZUMAB EMTANSINE,47625008,100MG,,1,1,415818006,1,0,21,NCBPS01C,,,,,,1151.99,Y
1,202223,RXR,RXR01,27T,800,14/04/2022,,ATEZOLIZUMAB,47625008,1200MG,20ML,1,1,415818006,1,9277487,21,NCBPS01C,,,,,,1256.53,Y
1,202223,RXR,RXR01,27T,370,05/04/2022,,HYDROXYCARBAMIDE,26643006,500MG,,100,0.84,428641000,3,0,21,NCBPS01C,,,,,,0.1,N
1,202223,RXR,RXR01,27T,303,27/04/2022,,DOXORUBICIN,47625008,50MG,25ML,1,1,415818006,1,0,21,NCBPS01C,,,,,,6.58,Y
1,202223,RXR,RXR01,27T,303,11/04/2022,,DOXORUBICIN,47625008,50MG,25ML,1,1,415818006,1,0,21,NCBPS01C,,,,,,6.58,Y
1,202223,RXR,RXR01,27T,303,27/04/2022,,VINCRISTINE,47625008,2MG,2,1,1,415818006,1,0,21,NCBPS01C,,,,,,7.57,Y
1,202223,RXR,RXR01,27T,303,11/04/2022,,VINCRISTINE,47625008,2MG,2,1,1,415818006,1,0,21,NCBPS01C,,,,,,8.09,Y
1,202223,RXR,RXR01,27T,370,05/04/2022,,MITOMYCIN,372471009,40MG,,1,1,415818006,2,0,21,NCBPS01C,,,,,,108,Y
1,202223,RXR,RXR01,27T,370,27/04/2022,,MITOMYCIN,372471009,40MG,,1,1,415818006,2,0,21,NCBPS01C,,,,,,108,Y
1,202223,RXR,RXR01,27T,370,12/04/2022,,MITOMYCIN,372471009,40MG,,1,1,415818006,2,0,21,NCBPS01C,,,,,,108,Y
1,202223,RXR,RXR01,27T,370,20/04/2022,,GEMCITABINE,47625008,1200MG,120ML,1,1,428672001,1,0,21,NCBPS01C,,,,,,39.6,Y
1,202223,RXR,RXR01,27T,370,25/04/2022,,GEMCITABINE,47625008,1200MG,120ML,1,1,428672001,2,0,21,NCBPS01C,,,,,,39.6,Y
1,202223,RXR,RXR01,27T,370,14/04/2022,,PEMBROLIZUMAB,47625008,100MG,4ML,1,2,415818006,1,0,21,NCBPS01C,,,,,,1380.76,Y
1,202223,RXR,RXR01,27T,370,13/04/2022,,FLUOROURACIL,47625008,600MG,24ML,1,1,415818006,2,0,21,NCBPS01C,,,,,,15.06,Y
1,202223,RXR,RXR01,27T,370,27/04/2022,,FLUOROURACIL,47625008,600MG,24ML,1,1,415818006,2,0,21,NCBPS01C,,,,,,15.06,Y
1,202223,RXR,RXR01,27T,370,27/04/2022,,FLUOROURACIL,47625008,5000MG,100ML,1,1,415818006,1,0,21,NCBPS01C,,,,,,12,Y
1,202223,RXR,RXR01,27T,370,13/04/2022,,FLUOROURACIL,47625008,5000MG,100ML,1,1,415818006,1,0,21,NCBPS01C,,,,,,12,Y
1,202223,RXR,RXR01,27T,300,05/04/2022,,APALUTAMIDE,26643006,60MG,,112,1,428673006,3,10356098,21,NCBPS01C,,,,,,6.1,N
1,202223,RXR,RXR01,27T,370,16/04/2022,,PACLITAXEL ALBUMIN,47625008,100MG,,1,4,415818006,1,0,21,NCBPS01C,,,,,,169.2,Y
1,202223,RXR,RXR01,27T,370,20/04/2022,,CAPECITABINE,26643006,500MG,,120,0.4667,428673006,3,0,21,NCBPS01C,,,,,,0.19,N
1,202223,RXR,RXR01,27T,370,06/04/2022,,NIVOLUMAB,47625008,240MG,24ML,1,2,415818006,1,8960608,21,NCBPS01C,,,,,,1805.08,Y
1,202223,RXR,RXR02,27T,370,25/04/2022,,FLUOROURACIL,6064005,5%,,1,1,258682000,3,0,21,NCBPS01C,,,,,,32.39,N
1,202223,RXR,RXR01,27T,800,14/04/2022,,PALBOCICLIB,26643006,100MG,,21,1,428641000,3,8556336,21,NCBPS01C,,,,,,42.14,N
1,202223,RXR,RXR01,27T,370,21/04/2022,,ABIRATERONE,26643006,500MG,,56,1,428673006,3,6203990,21,NCBPS01C,,,,,,22.09,N
1,202223,RXR,RXR01,27T,370,14/04/2022,,HYDROXYCARBAMIDE,26643006,500MG,,100,0.72,428641000,3,0,21,NCBPS01C,,,,,,0.1,N
1,202223,RXR,RXR01,13Q,300,11/04/2022,,AVELUMAB,47625008,200MG,10ML,1,4,415818006,1,7149703,31,NCBCDXXX,AVE3,,,,,414.72,Y
1,202223,RXR,RXR01,13Q,300,27/04/2022,,AVELUMAB,47625008,200MG,10ML,1,4,415818006,1,7149703,31,NCBCDXXX,AVE3,,,,,289.38,Y
1,202223,RXR,RXR01,27T,370,13/04/2022,,ABIRATERONE,26643006,500MG,,56,1,428673006,3,8600033,21,NCBPS01C,,,,,,22.09,N
1,202223,RXR,RXR01,27T,370,13/04/2022,,ABIRATERONE,26643006,500MG,,56,1,428673006,3,8390091,21,NCBPS01C,,,,,,22.09,N
1,202223,RXR,RXR01,27T,800,29/04/2022,,EVEROLIMUS,26643006,5MG,,30,1,428673006,3,4666318,21,NCBPS01C,,,,,,14.87,N
1,202223,RXR,RXR01,27T,800,08/04/2022,,EVEROLIMUS,26643006,5MG,,30,1,428673006,3,4666318,21,NCBPS01C,,,,,,22.5,N
1,202223,RXR,RXR01,27T,800,11/04/2022,,APALUTAMIDE,26643006,60MG,,112,1,428673006,3,0,21,NCBPS01C,,,,,,6.1,N
1,202223,RXR,RXR01,27T,800,20/04/2022,,PEMBROLIZUMAB,47625008,100MG,4ML,1,2,415818006,1,9235321,21,NCBPS01C,,,,,,1380.76,Y
1,202223,RXR,RXR01,27T,370,16/04/2022,,PEMBROLIZUMAB,47625008,100MG,4ML,1,2,415818006,1,9136294,21,NCBPS01C,,,,,,1380.76,Y
1,202223,RXR,RXR01,27T,300,29/04/2022,,NORMAL IMMUNOGLOBULIN HUMAN,372461007,5000MG,50ML,1,1,415818006,1,0,21,NCBPS16X,,,,,,304.77,Y
1,202223,RXR,RXR01,27T,300,29/04/2022,,NORMAL IMMUNOGLOBULIN HUMAN,372461007,5000MG,50ML,1,1,415818006,1,0,21,NCBPS16X,,,,,,304.77,Y
1,202223,RXR,RXR01,27T,370,22/04/2022,,PERTUZUMAB + TRASTUZUMAB,34206005,600MG/600MG,10ML,1,1,415818006,1,0,21,NCBPS01C,,,,,,1941.6,Y
1,202223,RXR,RXR01,27T,370,06/04/2022,,FLUOROURACIL,47625008,500MG,20ML,1,1,415818006,2,0,21,NCBPS01C,,,,,,12.44,Y
1,202223,RXR,RXR01,27T,370,21/04/2022,,FLUOROURACIL,47625008,500MG,20ML,1,1,415818006,2,0,21,NCBPS01C,,,,,,12.44,Y
1,202223,RXR,RXR01,27T,370,08/04/2022,,FLUOROURACIL,47625008,2500MG,50ML,1,2,415818006,1,0,21,NCBPS01C,,,,,,6,Y
1,202223,RXR,RXR01,27T,370,08/04/2022,,FLUOROURACIL,47625008,2500MG,50ML,1,2,415818006,1,0,21,NCBPS01C,,,,,,6,Y
1,202223,RXR,RXR01,27T,370,06/04/2022,,CETUXIMAB,47625008,500MG,100ML,1,1,415818006,1,9594016,21,NCBPS01C,,,,,,480.9,Y
1,202223,RXR,RXR01,27T,370,21/04/2022,,CETUXIMAB,47625008,500MG,100ML,1,1,415818006,1,9594016,21,NCBPS01C,,,,,,480.9,Y
1,202223,RXR,RXR01,27T,300,14/04/2022,,SOTROVIMAB,47625008,500MG,8ML,1,1,415818006,1,0,21,NCBPS18A,,,,,,0,Y
1,202223,RXR,RXR01,27T,370,07/04/2022,,MITOMYCIN,372471009,40MG,,1,1,415818006,2,0,21,NCBPS01C,,,,,,108,Y
1,202223,RXR,RXR01,27T,300,25/04/2022,,PEMBROLIZUMAB,47625008,100MG,4ML,1,2,415818006,1,0,21,NCBPS01C,,,,,,1380.76,Y
1,202223,RXR,RXR01,27T,800,06/04/2022,,OSIMERTINIB,26643006,40MG,,30,1,428673006,3,8382807,21,NCBPS01C,,,,,,90.01,N
1,202223,RXR,RXR01,13Q,303,06/04/2022,,IBRUTINIB,26643006,420MG,,28,1,428641000,2,6307954,31,NCBCDXXX,IBR4,,,,,0,Y
1,202223,RXR,RXR01,27T,303,29/04/2022,,NILOTINIB,26643006,150MG,,112,1,428641000,3,3812983,21,NCBPS01C,,,,,,14.37,N
1,202223,RXR,RXR01,27T,370,27/04/2022,,CETUXIMAB,47625008,500MG,100ML,1,2,415818006,1,10059235,21,NCBPS01C,,,,,,480.9,Y
1,202223,RXR,RXR01,27T,370,11/04/2022,,CETUXIMAB,47625008,500MG,100ML,1,2,415818006,1,10059235,21,NCBPS01C,,,,,,480.9,Y
1,202223,RXR,RXR01,27T,370,11/04/2022,,FLUOROURACIL,47625008,2500MG,50ML,1,3,415818006,1,0,21,NCBPS01C,,,,,,6,Y
1,202223,RXR,RXR01,27T,370,27/04/2022,,FLUOROURACIL,47625008,2500MG,50ML,1,3,415818006,1,0,21,NCBPS01C,,,,,,6,Y
1,202223,RXR,RXR01,27T,370,11/04/2022,,IRINOTECAN,47625008,330MG,220ML,1,1,428672001,2,0,21,NCBPS01C,,,,,,78,Y
1,202223,RXR,RXR01,27T,370,27/04/2022,,IRINOTECAN,47625008,330MG,220ML,1,1,428672001,2,0,21,NCBPS01C,,,,,,78,Y
1,202223,RXR,RXR01,27T,370,05/04/2022,,CAPECITABINE,26643006,500MG,,120,0.4667,428673006,3,0,21,NCBPS01C,,,,,,0.19,N
1,202223,RXR,RXR01,27T,370,28/04/2022,,CAPECITABINE,26643006,500MG,,120,0.4667,428673006,3,0,21,NCBPS01C,,,,,,0.19,N
1,202223,RXR,RXR01,27T,370,28/04/2022,,CAPECITABINE,26643006,500MG,,120,0.4667,428673006,3,0,21,NCBPS01C,,,,,,0.19,N
1,202223,RXR,RXR01,27T,370,11/04/2022,,CAPECITABINE,26643006,500MG,,120,0.7,428673006,3,0,21,NCBPS01C,,,,,,0.19,N
1,202223,RXR,RXR01,13Q,303,13/04/2022,,IBRUTINIB,26643006,140MG,,28,2,428641000,2,3459599,31,NCBCDXXX,IBR4,,,,,0,Y
1,202223,RXR,RXR01,27T,300,28/04/2022,,SOTROVIMAB,47625008,500MG,8ML,1,1,415818006,1,0,21,NCBPS18A,,,,,,0,Y
1,202223,RXR,RXR01,27T,370,01/04/2022,,PACLITAXEL ALBUMIN,47625008,100MG,,1,2,415818006,1,0,21,NCBPS01C,,,,,,169.2,Y
1,202223,RXR,RXR01,27T,370,20/04/2022,,PACLITAXEL ALBUMIN,47625008,100MG,,1,2,415818006,1,0,21,NCBPS01C,,,,,,169.2,Y
1,202223,RXR,RXR01,27T,370,29/04/2022,,PACLITAXEL ALBUMIN,47625008,100MG,,1,2,415818006,1,0,21,NCBPS01C,,,,,,169.2,Y
1,202223,RXR,RXR01,27T,370,25/04/2022,,PACLITAXEL ALBUMIN,47625008,100MG,,1,2,415818006,1,0,21,NCBPS01C,,,,,,169.2,Y
1,202223,RXR,RXR01,27T,370,20/04/2022,,PACLITAXEL,47625008,30MG,5ML,1,1,415818006,1,0,21,NCBPS01C,,,,,,6.24,Y
1,202223,RXR,RXR01,27T,370,27/04/2022,,PACLITAXEL,47625008,30MG,5ML,1,1,415818006,1,0,21,NCBPS01C,,,,,,6.24,Y
1,202223,RXR,RXR01,27T,370,01/04/2022,,PACLITAXEL,47625008,30MG,5ML,1,1,415818006,1,0,21,NCBPS01C,,,,,,6.24,Y
1,202223,RXR,RXR01,27T,370,13/04/2022,,PACLITAXEL,47625008,30MG,5ML,1,1,415818006,1,0,21,NCBPS01C,,,,,,6.24,Y
1,202223,RXR,RXR01,27T,370,13/04/2022,,CARBOPLATIN,47625008,400MG,540ML,1,1,428672001,2,0,21,NCBPS01C,,,,,,39.8,Y
1,202223,RXR,RXR01,27T,120,28/04/2022,,ANIDULAFUNGIN,47625008,100MG,,1,13,415818006,1,0,21,NCBPS18A,,,,,,37.78,Y
1,202223,RXR,RXR01,27T,120,23/04/2022,,ANIDULAFUNGIN,47625008,100MG,,1,2,415818006,1,0,21,NCBPS18A,,,,,,37.78,Y
1,202223,RXR,RXR01,27T,120,25/04/2022,,ANIDULAFUNGIN,47625008,100MG,,1,7,415818006,1,0,21,NCBPS18A,,,,,,70.16,Y
1,202223,RXR,RXR01,27T,120,12/04/2022,,ANIDULAFUNGIN,47625008,100MG,,1,7,415818006,1,0,21,NCBPS18A,,,,,,37.78,Y
1,202223,RXR,RXR01,27T,120,19/04/2022,,ANIDULAFUNGIN,47625008,100MG,,1,2,415818006,1,0,21,NCBPS18A,,,,,,37.78,Y
1,202223,RXR,RXR01,27T,120,20/04/2022,,ANIDULAFUNGIN,47625008,100MG,,1,2,415818006,1,0,21,NCBPS18A,,,,,,37.78,Y
1,202223,RXR,RXR01,13Q,350,28/04/2022,,SOFOSBUVIR + VELPATASVIR,26643006,500,,28,1,428673006,3,0,41,NCBHCXXX,,,,,,54.25,N
1,202223,RXR,RXR01,27T,370,05/04/2022,,MITOMYCIN,372471009,40MG,,1,1,415818006,1,0,21,NCBPS01C,,,,,,108,Y
1,202223,RXR,RXR01,27T,370,22/04/2022,,FLUOROURACIL,6064005,5%,,1,1,258682000,3,0,21,NCBPS01C,,,,,,32.37,N
1,202223,RXR,RXR01,27T,370,12/04/2022,,CAPECITABINE,26643006,500MG,,120,0.4667,428673006,3,0,21,NCBPS01C,,,,,,0.19,N
1,202223,RXR,RXR02,27T,370,12/04/2022,,FLUOROURACIL,6064005,5%,,1,1,258682000,3,0,21,NCBPS01C,,,,,,32.9,N
1,202223,RXR,RXR01,27T,370,06/04/2022,,FLUOROURACIL,47625008,500MG,20ML,1,1,415818006,2,0,21,NCBPS01C,,,,,,12.44,Y
1,202223,RXR,RXR01,27T,370,21/04/2022,,FLUOROURACIL,47625008,3500MG,115ML,1,1,1.06961E+16,2,0,21,NCBPS01C,,,,,,60.65,Y
1,202223,RXR,RXR01,27T,370,29/04/2022,,FLUOROURACIL,47625008,5000MG,100ML,1,1,415818006,1,0,21,NCBPS01C,,,,,,12,Y
1,202223,RXR,RXR01,27T,370,21/04/2022,,FLUOROURACIL,47625008,5000MG,100ML,1,1,415818006,1,0,21,NCBPS01C,,,,,,12,Y
1,202223,RXR,RXR01,27T,370,04/04/2022,,FLUOROURACIL,47625008,2500MG,50ML,1,2,415818006,1,0,21,NCBPS01C,,,,,,6,Y
1,202223,RXR,RXR01,27T,800,12/04/2022,,TIVOZANIB,26643006,1340MCG,,21,1,428641000,3,4426767,21,NCBPS01C,,,,,,34.2,N
1,202223,RXR,RXR01,27T,800,14/04/2022,,TIVOZANIB,26643006,1340MCG,,21,1,428641000,3,4426767,21,NCBPS01C,,,,,,34.2,N
1,202223,RXR,RXR01,13Q,350,28/04/2022,,SOFOSBUVIR + VELPATASVIR + VOXILAPREVIR ,26643006,400/100/100,,28,1,428673006,3,10413983,41,NCBHCXXX,,,,,,152.39,N
1,202223,RXR,RXR01,27T,370,27/04/2022,,PACLITAXEL ALBUMIN,47625008,100MG,,1,2,415818006,1,0,21,NCBPS01C,,,,,,169.2,Y
1,202223,RXR,RXR01,27T,370,29/04/2022,,PACLITAXEL ALBUMIN,47625008,100MG,,1,2,415818006,1,0,21,NCBPS01C,,,,,,169.2,Y
1,202223,RXR,RXR01,27T,370,12/04/2022,,PACLITAXEL ALBUMIN,47625008,100MG,,1,2,415818006,1,0,21,NCBPS01C,,,,,,169.2,Y
1,202223,RXR,RXR01,27T,370,05/04/2022,,MITOMYCIN,372471009,40MG,,1,1,415818006,2,0,21,NCBPS01C,,,,,,108,Y
1,202223,RXR,RXR01,27T,370,20/04/2022,,FLUOROURACIL,47625008,3500MG,115ML,1,1,1.06961E+16,2,0,21,NCBPS01C,,,,,,60.65,Y
1,202223,RXR,RXR01,27T,370,20/04/2022,,FLUOROURACIL,47625008,600MG,24ML,1,1,415818006,2,0,21,NCBPS01C,,,,,,15.06,Y
1,202223,RXR,RXR01,27T,370,11/04/2022,,MITOMYCIN,372471009,40MG,,1,1,415818006,2,0,21,NCBPS01C,,,,,,108,Y
1,202223,RXR,RXR01,27T,303,20/04/2022,,CYCLOPHOSPHAMIDE,47625008,1000MG,,1,1,415818006,1,0,21,NCBPS01C,,,,,,16.03,Y
1,202223,RXR,RXR01,27T,303,20/04/2022,,CYCLOPHOSPHAMIDE,47625008,500MG,,1,1,415818006,1,0,21,NCBPS01C,,,,,,9.6,Y
1,202223,RXR,RXR01,27T,370,05/04/2022,,HYDROXYCARBAMIDE,26643006,500MG,,100,0.84,428641000,3,0,21,NCBPS01C,,,,,,0.1,N
1,202223,RXR,RXR01,27T,370,22/04/2022,,ERIBULIN,47625008,0.88MG/2ML,2ML,1,3,415818006,1,10120371,21,NCBPS01C,,,,,,240,Y
1,202223,RXR,RXR01,27T,370,06/04/2022,,ERIBULIN,47625008,0.88MG/2ML,2ML,1,3,415818006,1,10120371,21,NCBPS01C,,,,,,240,Y
1,202223,RXR,RXR01,13Q,303,13/04/2022,,IBRUTINIB,26643006,140MG,,28,2,428641000,2,6888823,31,NCBCDXXX,IBR4,,,,,0,Y
1,202223,RXR,RXR01,27T,303,27/04/2022,,RITUXIMAB,34206005,1400MG,11.7ML,1,1,415818006,1,0,21,NCBPS01C,,,,,,1209.6,Y
1,202223,RXR,RXR02,27T,370,05/04/2022,,FLUOROURACIL,6064005,5%,,1,1,258682000,3,0,21,NCBPS01C,,,,,,32.37,N
1,202223,RXR,RXR01,27T,370,28/04/2022,,TRASTUZUMAB EMTANSINE,47625008,100MG,,1,1,415818006,1,0,21,NCBPS01C,,,,,,1151.99,Y
1,202223,RXR,RXR01,27T,370,06/04/2022,,FLUOROURACIL,47625008,500MG,20ML,1,1,415818006,2,0,21,NCBPS01C,,,,,,12.44,Y
1,202223,RXR,RXR01,27T,370,08/04/2022,,FLUOROURACIL,47625008,2500MG,50ML,1,2,415818006,1,0,21,NCBPS01C,,,,,,6,Y
1,202223,RXR,RXR01,27T,303,06/04/2022,,HYDROXYCARBAMIDE,26643006,500MG,,100,0.96,428641000,3,0,21,NCBPS01C,,,,,,0.1,N
1,202223,RXR,RXR01,27T,370,27/04/2022,,CARBOPLATIN,47625008,600MG,60ML,1,1,415818006,1,0,21,NCBPS01C,,,,,,23.38,Y
1,202223,RXR,RXR01,27T,370,27/04/2022,,PACLITAXEL,47625008,30MG,5ML,1,2,415818006,1,0,21,NCBPS01C,,,,,,6.24,Y
1,202223,RXR,RXR01,27T,370,27/04/2022,,CARBOPLATIN,47625008,150MG,15ML,1,1,415818006,1,0,21,NCBPS01C,,,,,,7.18,Y
1,202223,RXR,RXR01,27T,800,07/04/2022,,NINTEDANIB,26643006,100MG,,60,0.4,428641000,3,0,21,NCBPS01C,,,,,,52.7,N
1,202223,RXR,RXR01,27T,800,19/04/2022,,NINTEDANIB,26643006,100MG,,60,1.3333,428641000,3,0,21,NCBPS01C,,,,,,15.06,N
1,202223,RXR,RXR01,27T,370,14/04/2022,,PACLITAXEL,47625008,30MG,5ML,1,2,415818006,1,0,21,NCBPS01C,,,,,,6.24,Y
1,202223,RXR,RXR01,27T,370,08/04/2022,,PACLITAXEL,47625008,30MG,5ML,1,2,415818006,1,0,21,NCBPS01C,,,,,,6.24,Y
1,202223,RXR,RXR01,27T,370,20/04/2022,,FLUOROURACIL,6064005,5%,,1,1,258682000,3,0,21,NCBPS01C,,,,,,32.37,N
1,202223,RXR,RXR01,27T,370,26/04/2022,,FLUOROURACIL,47625008,5000MG,100ML,1,1,415818006,1,0,21,NCBPS01C,,,,,,12,Y
1,202223,RXR,RXR01,27T,370,26/04/2022,,FLUOROURACIL,47625008,600MG,24ML,1,1,415818006,2,0,21,NCBPS01C,,,,,,15.06,Y
1,202223,RXR,RXR01,27T,370,19/04/2022,,FLUOROURACIL,47625008,600MG,24ML,1,1,415818006,2,0,21,NCBPS01C,,,,,,15.06,Y
1,202223,RXR,RXR01,27T,370,28/04/2022,,FLUOROURACIL,6064005,5%,,1,1,258682000,3,0,21,NCBPS01C,,,,,,32.37,N
1,202223,RXR,RXR01,27T,370,06/04/2022,,LANREOTIDE,34206005,120MG,,1,1,3.31861E+15,3,0,21,NCBPS01C,,,,,,937,N
1,202223,RXR,RXR01,27T,370,14/04/2022,,CETUXIMAB,47625008,500MG,100ML,1,1,415818006,1,0,21,NCBPS01C,,,,,,480.9,Y
1,202223,RXR,RXR01,27T,370,27/04/2022,,CETUXIMAB,47625008,500MG,100ML,1,1,415818006,1,0,21,NCBPS01C,,,,,,480.9,Y
1,202223,RXR,RXR01,27T,370,21/04/2022,,ATEZOLIZUMAB,47625008,1200MG,20ML,1,1,415818006,1,0,21,NCBPS01C,,,,,,1256.53,Y
1,202223,RXR,RXR01,27T,370,21/04/2022,,CARBOPLATIN,47625008,600MG,60ML,1,1,415818006,1,0,21,NCBPS01C,,,,,,23.38,Y
1,202223,RXR,RXR01,27T,370,21/04/2022,,ETOPOSIDE,26643006,50MG,,20,0.1,428641000,3,0,21,NCBPS01C,,,,,,4.99,N
1,202223,RXR,RXR01,27T,370,01/04/2022,,ETOPOSIDE,26643006,50MG,,20,0.1,428641000,3,0,21,NCBPS01C,,,,,,4.99,N
1,202223,RXR,RXR01,27T,303,11/04/2022,,RUXOLITINIB,26643006,15MG,,56,1,428673006,3,0,21,NCBPS01C,,,,,,39,N
1,202223,RXR,RXR01,27T,370,21/04/2022,,ENZALUTAMIDE,26643006,40MG,,112,1,428673006,3,0,21,NCBPS01C,,,,,,6.1,N
1,202223,RXR,RXR01,27T,303,14/04/2022,,ACALABRUTINIB,26643006,100MG,,60,0.9333,428641000,3,10389709,21,NCBPS01C,,,,,,34.17,N
1,202223,RXR,RXR01,27T,370,04/04/2022,,PACLITAXEL,47625008,100MG,16.7ML,1,1,415818006,1,0,21,NCBPS01C,,,,,,8.68,Y
1,202223,RXR,RXR01,27T,370,27/04/2022,,PACLITAXEL,47625008,100MG,16.7ML,1,1,415818006,1,0,21,NCBPS01C,,,,,,8.68,Y
1,202223,RXR,RXR01,27T,370,16/04/2022,,PACLITAXEL,47625008,100MG,16.7ML,1,1,415818006,1,0,21,NCBPS01C,,,,,,8.68,Y
1,202223,RXR,RXR01,27T,370,04/04/2022,,CARBOPLATIN,47625008,630MG,563ML,1,1,428672001,2,0,21,NCBPS01C,,,,,,54.23,Y
1,202223,RXR,RXR01,27T,370,27/04/2022,,OXALIPLATIN,47625008,200MG,40ML,1,1,415818006,1,0,21,NCBPS01C,,,,,,9.6,Y
1,202223,RXR,RXR01,27T,370,12/04/2022,,OXALIPLATIN,47625008,200MG,40ML,1,1,415818006,1,0,21,NCBPS01C,,,,,,9.6,Y
1,202223,RXR,RXR01,27T,370,27/04/2022,,FLUOROURACIL,47625008,200MG,8ML,1,1,415818006,2,0,21,NCBPS01C,,,,,,13.72,Y
1,202223,RXR,RXR01,27T,370,11/04/2022,,FLUOROURACIL,47625008,200MG,8ML,1,1,415818006,2,0,21,NCBPS01C,,,,,,13.72,Y
1,202223,RXR,RXR01,27T,370,22/04/2022,,VINORELBINE,26643006,80MG,,1,2,428641000,3,0,21,NCBPS01C,,,,,,96.76,N
1,202223,RXR,RXR01,27T,370,06/04/2022,,CARBOPLATIN,47625008,450MG,45ML,1,2,415818006,1,0,21,NCBPS01C,,,,,,17.74,Y
1,202223,RXR,RXR01,27T,370,21/04/2022,,ETOPOSIDE,26643006,100MG,,10,0.6,428641000,3,0,21,NCBPS01C,,,,,,8.72,N
1,202223,RXR,RXR01,27T,370,06/04/2022,,ETOPOSIDE,47625008,500MG/25ML,25,1,1,415818006,1,0,21,NCBPS01C,,,,,,16.18,Y
1,202223,RXR,RXR01,27T,370,14/04/2022,,ETOPOSIDE,47625008,500MG/25ML,25,1,1,415818006,1,0,21,NCBPS01C,,,,,,16.18,Y
1,202223,RXR,RXR01,27T,370,26/04/2022,,OXALIPLATIN,47625008,200MG,40ML,1,1,415818006,1,0,21,NCBPS01C,,,,,,9.6,Y
1,202223,RXR,RXR01,27T,370,13/04/2022,,OXALIPLATIN,47625008,135MG,527ML,1,1,415818006,2,0,21,NCBPS01C,,,,,,27.01,Y
1,202223,RXR,RXR01,27T,800,14/04/2022,,CABOZANTINIB,26643006,40MG,,30,1,428673006,3,10019410,21,NCBPS01C,,,,,,171.43,N
1,202223,RXR,RXR01,27T,800,25/04/2022,,CABOZANTINIB,26643006,40MG,,30,1,428673006,3,10019410,21,NCBPS01C,,,,,,171.43,N
1,202223,RXR,RXR01,27T,370,21/04/2022,,OXALIPLATIN,47625008,50MG,10ML,1,1,415818006,1,0,21,NCBPS01C,,,,,,4.56,Y
1,202223,RXR,RXR01,27T,370,21/04/2022,,OXALIPLATIN,47625008,100MG,20ML,1,1,415818006,1,0,21,NCBPS01C,,,,,,9.02,Y
1,202223,RXR,RXR01,27T,800,27/04/2022,,GEMCITABINE,47625008,1000MG,10ML,1,1,415818006,1,0,21,NCBPS01C,,,,,,10.8,Y
1,202223,RXR,RXR01,27T,800,22/04/2022,,GEMCITABINE,47625008,1000MG,10ML,1,1,415818006,1,0,21,NCBPS01C,,,,,,10.8,Y
1,202223,RXR,RXR01,27T,800,21/04/2022,,GEMCITABINE,47625008,1000MG,10ML,1,1,415818006,1,0,21,NCBPS01C,,,,,,10.8,Y
1,202223,RXR,RXR01,27T,800,20/04/2022,,CARBOPLATIN,47625008,450MG,45ML,1,1,415818006,1,0,21,NCBPS01C,,,,,,17.74,Y
1,202223,RXR,RXR01,27T,800,11/04/2022,,CARBOPLATIN,47625008,450MG,45ML,1,1,415818006,1,0,21,NCBPS01C,,,,,,17.74,Y
1,202223,RXR,RXR01,27T,303,20/04/2022,,CYCLOPHOSPHAMIDE,47625008,50MG,2.5ML,1,2,3.31861E+15,2,0,21,NCBPS01C,,,,,,18.37,Y
1,202223,RXR,RXR01,27T,303,07/04/2022,,CYCLOPHOSPHAMIDE,47625008,200MG,10ML,1,3,3.31861E+15,2,0,21,NCBPS01C,,,,,,19.2,Y
1,202223,RXR,RXR01,27T,303,20/04/2022,,CYCLOPHOSPHAMIDE,47625008,1000MG,50ML,1,1,3.31861E+15,2,0,21,NCBPS01C,,,,,,22.39,Y
1,202223,RXR,RXR01,27T,303,07/04/2022,,CYCLOPHOSPHAMIDE,47625008,500MG,25ML,1,1,3.31861E+15,2,0,21,NCBPS01C,,,,,,20.3,Y
1,202223,RXR,RXR01,27T,303,06/04/2022,,CYCLOPHOSPHAMIDE,47625008,500MG,25ML,1,1,3.31861E+15,2,0,21,NCBPS01C,,,,,,20.3,Y
1,202223,RXR,RXR01,27T,800,12/04/2022,,PALBOCICLIB,26643006,125MG,,21,1,428641000,3,6873551,21,NCBPS01C,,,,,,42.14,N
1,202223,RXR,RXR01,27T,800,11/04/2022,,DAROLUTAMIDE,26643006,300MG,,112,1,428673006,3,8042963,21,NCBPS01C,,,,,,7.59,N
1,202223,RXR,RXR01,27T,370,29/04/2022,,CYCLOPHOSPHAMIDE,47625008,500MG,25ML,1,1,3.31861E+15,2,0,21,NCBPS01C,,,,,,20.3,Y
1,202223,RXR,RXR01,27T,370,06/04/2022,,CYCLOPHOSPHAMIDE,47625008,500MG,25ML,1,1,3.31861E+15,2,0,21,NCBPS01C,,,,,,20.3,Y
1,202223,RXR,RXR01,27T,370,29/04/2022,,CYCLOPHOSPHAMIDE,47625008,200MG,10ML,1,2,3.31861E+15,2,0,21,NCBPS01C,,,,,,19.2,Y
1,202223,RXR,RXR01,27T,370,06/04/2022,,CYCLOPHOSPHAMIDE,47625008,200MG,10ML,1,2,3.31861E+15,2,0,21,NCBPS01C,,,,,,19.2,Y
1,202223,RXR,RXR01,27T,370,29/04/2022,,DOCETAXEL,47625008,20MG,1ML,1,6,415818006,1,0,21,NCBPS01C,,,,,,3.61,Y
1,202223,RXR,RXR01,27T,370,06/04/2022,,DOCETAXEL,47625008,20MG,1ML,1,6,415818006,1,0,21,NCBPS01C,,,,,,3.66,Y