Organisation_Identifier_(Code_Of_Provider),organisation_identifier_of_sact_administration,Primary_Diagnosis,Morphology_ICD-O,Diagnosis_Code_(SNOMED_CT),Adjunctive_Therapy,Drug_Name,DM+D,Actual_Dose_Per_Administration,Unit_of_Measurement_(SNOMED_CT_DM+D),Administration_date,Intent_Of_Treatment,Clinical_trial,Regimen,Cycle_number
RXR,RXR,C509,,,9,Capecitabine,108761006,800,,2022-05-20,02; 03; 04; 05,2,Capecitabine and Vinorelbine,4
RXR,RXR,C509,,,9,Vinorelbine,108792008,80,,2022-04-13,02; 03; 05,2,Single agent Oral Vinorelbine,5
RXR,RXR,C20X,,,1,Oxaliplatin,327032007,165,,2022-08-05,98,2,Oxaliplatin plus oral Capecitabine (CAPOX 3-weekly adjuvant),5
RXR,RXR,C259,,,9,Oxaliplatin,327032007,120,,2022-08-31,05,2,FOLFIRINOX,2
RXR,RXR,C819,,,9,Procarbazine,81583003,200,,2022-08-22,01,2,CHLVPP,1
RXR,RXR,C911,,,1,Ibrutinib,28393111000001103,420,,2022-04-11,05,2,Ibrutinib CLL relapsed (NICE - Blueteq),3
RXR,RXR,C349,,,9,Pemetrexed,411089001,800,,2022-04-01,02; 05,2,"Pembrolizumab, carboplatin and pemetrexed (CDF Blueteq)",1
RXR,RXR,C508,,,9,Everolimus,428127005,10,,2022-05-05,02; 03; 04; 05,2,Everolimus - MBC/RCC/NET (NICE Blueteq),1
RXR,RXR,C509,,,2,Pertuzumab 1200mg and Trastuzumab 600mg in 15ml,,15,,2022-07-18,98,2,Paclitaxel (Weekly) Pertuzumab Trastuzumab,4
RXR,RXR,C90X,,,9,Azacitidine,412329008,100,,2022-04-07,99,2,Azacitidine (7 Day),60
RXR,RXR,C189,,,9,Fluorouracil,3127006,3150,,2022-06-08,04; 05,2,Irinotecan and modified de Gramont,25
RXR,RXR,C160,,,9,Oxaliplatin,327032007,180,,2022-05-20,01,2,"FLOT (5FU, Folinic acid, Oxaliplatin, Docetaxel)",2
RXR,RXR,C187,81402,,9,Irinotecan,108783005,260,,2022-06-10,02; 05,2,Irinotecan and modified de Gramont,34
RXR,RXR,C160,,,9,Capecitabine,108761006,1300,,2022-08-17,04,2,Pembrolizumab oxaliplatin capecitabine,3
RXR,RXR,C501,,,9,Palbociclib (Ibrance),,125,,2022-06-22,05,2,Palbociclib (NICE Blueteq),38
RXR,RXR,C349,,,9,Pemetrexed,411089001,550,,2022-07-12,02; 03; 05,2,Pemetrexed and Carboplatin,1
RXR,RXR,C56X,,,9,Paclitaxel,67735003,108,,2022-08-26,98,2,3-Weekly Carboplatin/weekly paclitaxel,8
RXR,RXR,C509,,,1,Docetaxel,108806006,108,,2022-06-15,98,2,Docetaxel and cyclophosphamide - EBC Adjuvant,4
RXR,RXR,C189,,,9,Irinotecan,108783005,270,,2022-07-28,02; 05,2,Irinotecan and modified de Gramont,4
RXR,RXR,C61X,,,9,JNJ-56021927 ,,240,,2022-05-31,02,1,SPARTAN trial Apalutamide,95
RXR,RXR,C61X,,,9,Enzalutamide,703684000,160,,2022-07-26,05,2,Enzalutamide,30
RXR,RXR,C259,,,9,Capecitabine,108761006,1000,,2022-05-13,04,2,Oxaliplatin plus oral Capecitabine (CAPOX 3 weekly),8
RXR,RXR,C61X,,,9,Enzalutamide,703684000,160,,2022-06-27,05,2,Enzalutamide,23
RXR,RXR,C82,,,9,Rituximab (MabThera),108809004,1400,,2022-08-09,98,2,Subcutaneous Rituximab (MabThera) Maintenance (8 weekly),10
RXR,RXR,C508,,,9,Capecitabine,108761006,1000,,2022-04-28,02; 03; 04; 05,2,Capecitabine - MBC,1
RXR,RXR,C189,,,9,Fluorouracil,3127006,400,,2022-04-21,98,2,Irinotecan and modified de Gramont,2
RXR,RXR,C349,,,9,Carboplatin,108759002,560,,2022-06-29,02; 05,2,Etoposide IV/Carboplatin,3
RXR,RXR,C90X,,,9,Bortezomib,398907002,3,,2022-08-19,05,2,Weekly Bortezomib (Velcade) Dexamethasone,1
RXR,RXR,C509,,,9,Palbociclib (Ibrance),,100,,2022-06-09,02; 03; 04; 05,2,Palbociclib (NICE Blueteq),30
RXR,RXR,C921,,,9,Imatinib,391634008,400,,2022-04-26,99,2,Imatinib (CML-Chronic phase),107
RXR,RXR,C56,,,9,Gemcitabine,108811008,1800,,2022-04-05,02; 03; 04; 05,2,Gemcitabine ovary 4-weekly cycle,2
RXR,RXR,C349,,,9,Pembrolizumab (Keytruda),,200,,2022-04-21,02; 05,2,Carboplatin Paclitaxel Pembrolizumab NSCLC (Blueteq),2
RXR,RXR,C20,,,9,Oxaliplatin,327032007,135,,2022-05-24,02; 05,2,Oxaliplatin and modified de Gramont (FOLFOX) - Metastatic Colorectal cancer,24
RXR,RXR,C37X,,,9,Vincristine,23079006,2,,2022-04-28,02; 03; 05,2,CAV,5
RXR,RXR,D379,,,9,Sunitinib,421448007,50,,2022-07-22,05,2,Sunitinib,13
RXR,RXR,C189,,,9,Fluorouracil,3127006,400,,2022-05-19,98,2,Irinotecan and modified de Gramont,4
RXR,RXR,C349,,,9,Atezolizumab (Tecentriq),,1200,,2022-08-18,02; 03; 05,2,Etoposide/Carboplatin/Atezolizumab (Blueteq),3
RXR,RXR,C61X,,,9,Apalutamide,,240,,2022-05-30,05,2,Apalutamide (Blueteq),8
RXR,RXR,C160,,,9,Fluorouracil,3127006,3150,,2022-04-11,01,2,"FLOT (5FU, Folinic acid, Oxaliplatin, Docetaxel)",4
RXR,RXR,C509,,,9,Palbociclib (Ibrance),,100,,2022-04-22,02; 03; 04; 05,2,Palbociclib (NICE Blueteq),1
RXR,RXR,C189,,,9,Irinotecan,108783005,360,,2022-07-01,02; 05,2,Irinotecan and modified de Gramont,2
RXR,RXR,C56X,,,9,Carboplatin,108759002,300,,2022-04-12,02; 03; 04; 05,2,Carboplatin (AUC 6),6
RXR,RXR,D473,,,1,Hydroxycarbamide,56602009,500,,2022-08-29,99,2,Hydroxycarbamide Flexible dose,30
RXR,RXR,C259,,,9,Oxaliplatin,327032007,90,,2022-05-24,05,2,Oxaliplatin plus oral Capecitabine (CAPOX 3 weekly),12
RXR,RXR,C20,,,9,Oxaliplatin,327032007,110,,2022-07-19,02; 05,2,Oxaliplatin and modified de Gramont (FOLFOX) - Metastatic Colorectal cancer,27
RXR,RXR,C187,,,9,Fluorouracil,3127006,2800,,2022-05-26,05,2,Irinotecan and modified de Gramont,40
RXR,RXR,C159,,,9,Carboplatin,108759002,400,,2022-06-22,02; 03; 05,2,"Trastuzumab, carboplatin, capecitabine (HCarboX)",3
RXR,RXR,C250,,,9,Irinotecan,108783005,270,,2022-08-17,05,2,FOLFIRINOX,1
RXR,RXR,C253,,,9,Gemcitabine,108811008,1000,,2022-04-28,02; 05,2,Nab-Paclitaxel (Abraxane) & Gemcitabine (NICE - Blueteq),18
RXR,RXR,C509,,,2,Paclitaxel,67735003,132,,2022-08-23,98,2,Carboplatin paclitaxel - EC,4
RXR,RXR,D473,,,1,Hydroxycarbamide,56602009,500,,2022-04-11,99,2,Hydroxycarbamide Flexible dose,41
RXR,RXR,C349,,,9,Pemetrexed,411089001,450,,2022-05-31,02; 05,2,Pemetrexed Maintenance,2
RXR,RXR,C189,,,9,Fluorouracil,3127006,600,,2022-07-14,02; 05,2,Irinotecan and modified de Gramont,3
RXR,RXR,C921,,,9,Imatinib,391634008,400,,2022-07-19,99,2,Imatinib (CML-Chronic phase),110
RXR,RXR,C502,,,9,Palbociclib (Ibrance),,125,,2022-04-20,05,2,Palbociclib (NICE Blueteq),50
RXR,RXR,C900,,,9,Isatuximab,,700,,2022-08-30,05,2,Isatuximab + Pomalidomide + Dexamethasone [Blueteq],15
RXR,RXR,D473,,,1,Hydroxycarbamide,56602009,1000,,2022-08-01,99,2,Hydroxycarbamide Flexible dose,48
RXR,RXR,C509,,,1,Paclitaxel,67735003,144,,2022-08-30,98,2,Paclitaxel Weekly (Breast),4
RXR,RXR,C187,81402,,9,Fluorouracil,3127006,3500,,2022-07-06,02; 04; 05,2,Irinotecan and modified de Gramont,16
RXR,RXR,C20,,,9,Fluorouracil,3127006,5000,,2022-05-24,02; 05,2,Oxaliplatin and modified de Gramont (FOLFOX) - Metastatic Colorectal cancer,24
RXR,RXR,C509,,,2,Paclitaxel,67735003,96,,2022-05-24,98,2,Carboplatin paclitaxel - EC,3
RXR,RXR,D471,,,1,Hydroxycarbamide,56602009,500,,2022-04-08,99,2,Hydroxycarbamide Flexible dose,2
RXR,RXR,C186,,,9,Oxaliplatin,327032007,150,,2022-04-29,02; 05,2,Oxaliplatin and modified de Gramont (FOLFOX) - Metastatic Colorectal cancer,1
RXR,RXR,C259,,,1,Oxaliplatin,327032007,150,,2022-06-29,99,2,mFOLFIRINOX,3
RXR,RXR,C504,,,9,Paclitaxel,67735003,108,,2022-05-30,05,2,3-Weekly Carboplatin/weekly paclitaxel,5
RXR,RXR,C189,,,9,Oxaliplatin,327032007,120,,2022-04-22,02; 05,2,Oxaliplatin and modified de Gramont (FOLFOX) - Metastatic Colorectal cancer,10
RXR,RXR,C56X,,,9,Niraparib,,200,,2022-08-04,02; 03; 04; 05,2,Niraparib (CDF Blueteq),16
RXR,RXR,C56X,,,9,Carboplatin,108759002,150,,2022-08-24,02; 03; 04; 05,2,Carboplatin (AUC 6),6
RXR,RXR,C61X,,,9,Enzalutamide,703684000,160,,2022-04-20,05,2,Enzalutamide,21
RXR,RXR,C349,,,9,Atezolizumab (Tecentriq),,1200,,2022-08-10,02; 03; 05,2,Etoposide/Carboplatin/Atezolizumab (Blueteq),2
RXR,RXR,C920,,,9,Azacitidine,412329008,160,,2022-08-11,,2,Venetoclax+Azacitidine AML (Blueteq),1
RXR,RXR,C343,,,9,Nintedanib,28786811000001101,200,,2022-07-04,05,2,Docetaxel/Nintedanib,1
RXR,RXR,C349,,,9,Atezolizumab (Tecentriq),,1200,,2022-07-14,02; 05,2,Etoposide/Carboplatin/Atezolizumab (Blueteq),46
RXR,RXR,C900,,,9,Pomalidomide,703790009,3,,2022-08-18,98,2,Pomalidomide (Blueteq),24
RXR,RXR,C189,,,9,Fluorouracil,3127006,2500,,2022-08-24,02; 05,2,Irinotecan and modified de Gramont,8
RXR,RXR,C61X,,,9,Abiraterone,19528811000001106,1000,,2022-08-02,05,2,Abiraterone (NICE - Blueteq),24
RXR,RXR,C90X,,,9,Carfilzomib,714783001,48,,2022-05-20,98,2,Carfilzomib-Lenalidomide-Dexamethasone [Blueteq],2
RXR,RXR,C20X,,,1,Capecitabine,108761006,1500,,2022-05-03,99,2,Oxaliplatin plus oral Capecitabine (CAPOX 3-weekly adjuvant),4
RXR,RXR,C186,,,9,Irinotecan,108783005,180,,2022-06-28,02; 04; 05,2,Irinotecan and modified de Gramont,16
RXR,RXR,C249,,,9,Capecitabine,108761006,1150,,2022-08-05,04,2,Capecitabine - Adjuvant Colorectal/biliary tract Cancer,2
RXR,RXR,C20,,,9,Fluorouracil,3127006,1800,,2022-05-23,02; 05,2,Oxaliplatin and modified de Gramont (FOLFOX) - Metastatic Colorectal cancer,12
RXR,RXR,C502,,,9,Abemaciclib,,150,,2022-05-03,05,2,Abemaciclib metastatic (Blueteq),33
RXR,RXR,C182,,,9,Cetuximab (Erbitux),409401002,900,,2022-07-15,02; 03; 05,2,Cetuximab colorectal (NICE Blueteq),2
RXR,RXR,C189,,,1,Oxaliplatin,327032007,200,,2022-07-26,99,2,Oxaliplatin plus oral Capecitabine (CAPOX 3-weekly adjuvant),7
RXR,RXR,C189,,,1,Capecitabine,108761006,2000,,2022-04-08,99,2,Oxaliplatin plus oral Capecitabine (CAPOX 3-weekly adjuvant),4
RXR,RXR,C90X,,,9,Bortezomib,398907002,3,,2022-07-12,05,2,DVTd (Daratumumab sc+Bortezomib+Thalidomide+Dexamethasone) (NICE - Blueteq),3
RXR,RXR,C159,,,9,Pembrolizumab (Keytruda),,200,,2022-05-09,05,2,Pembrolizumab oxaliplatin capecitabine,1
RXR,RXR,C61X,,,9,Abiraterone,19528811000001106,1000,,2022-06-20,05,2,Abiraterone (NICE - Blueteq),39
RXR,RXR,C649,,,9,Avelumab (Bavencio),,800,,2022-05-06,05,2,Axitinib Avelumab (Blueteq),15
RXR,RXR,C189,,,9,Oxaliplatin,327032007,225,,2022-07-05,02; 05,2,Oxaliplatin plus oral Capecitabine (CAPOX 3 weekly),2
RXR,RXR,C56X,,,9,Carboplatin,108759002,630,,2022-05-25,02; 03; 04; 05,2,Gemcitabine & Carboplatin (Ovarian),4
RXR,RXR,D471,,,1,Hydroxycarbamide,56602009,1000,,2022-08-25,99,2,Hydroxycarbamide Flexible dose,6
RXR,RXR,C341,,,9,Gemcitabine,108811008,1800,,2022-07-07,02; 04; 05,2,Carboplatin Gemcitabine NSCLC,4
RXR,RXR,C509,,,2,Pertuzumab 1200mg and Trastuzumab 600mg in 15ml,,15,,2022-05-09,01,2,"Trastuzumab/Pertuzumab (Subcutaneous), Docetaxel and Carboplatin (Blueteq) Neo-Adjuvant",1
RXR,RXR,C900,,,9,Daratumumab,,1800,,2022-05-17,05,2,Daratumumab s/c monotherapy  (NICE - Blueteq),8
RXR,RXR,C504,,,9,Trastuzumab (Kanjinti),,588,,2022-08-01,02,2,Trastuzumab IV - MBC,219
RXR,RXR,C187,81402,,9,Fluorouracil,3127006,600,,2022-04-19,02; 05,2,Irinotecan and modified de Gramont,20
RXR,RXR,C189,,,1,Fluorouracil,3127006,375,,2022-07-14,99,2,Oxaliplatin and modified de Gramont - Adjuvant Colorectal cancer,6
RXR,RXR,C189,,,9,Capecitabine,108761006,1500,,2022-06-29,02; 05,2,Capecitabine - Adjuvant Colorectal/biliary tract Cancer,3
RXR,RXR,C160,,,9,Oxaliplatin,327032007,100,,2022-07-25,04,2,Pembrolizumab oxaliplatin capecitabine,9
RXR,RXR,C880,,,1,Ibrutinib,28393111000001103,420,,2022-08-30,99,2,Ibrutinib Waldenstrom's Macroglobulinaemia (CDF - Blueteq),59
RXR,RXR,C189,,,9,Fluorouracil,3127006,3150,,2022-07-29,04; 05,2,Oxaliplatin and modified de Gramont (FOLFOX) - Metastatic Colorectal cancer,9
RXR,RXR,C61X,,,9,Docetaxel,108806006,132,,2022-07-07,02; 03; 04; 05,2,Docetaxel and prednisolone,6
RXR,RXR,C509,,,1,Cyclophosphamide,74470007,750,,2022-08-24,98,2,EC,2
RXR,RXR,C61X,,,9,Enzalutamide,703684000,160,,2022-07-11,05,2,Enzalutamide,19
RXR,RXR,C160,,,9,Capecitabine,108761006,1300,,2022-07-29,05,2,"OX Upper GI (Oxaliplatin, capecitabine)",2
RXR,RXR,C541,,,9,Paclitaxel,67735003,144,,2022-05-26,98,2,3-Weekly Carboplatin/weekly paclitaxel,1
RXR,RXR,C20X,,,2,Oxaliplatin,327032007,250,,2022-04-13,98,2,Oxaliplatin plus oral Capecitabine (CAPOX Total neoadjuvant therapy),1
RXR,RXR,C61X,,,9,Enzalutamide,703684000,80,,2022-04-12,05,2,Enzalutamide,2
RXR,RXR,C509,,,1,Epirubicin,349848009,160,,2022-06-27,98,2,EC,3
RXR,RXR,C182,81402,,9,Irinotecan,108783005,300,,2022-07-14,02; 04; 05,2,Irinotecan and modified de Gramont,2
RXR,RXR,C502,,,9,Pertuzumab (Perjeta),704227006,420,,2022-04-14,04,2,"Trastuzumab, pertuzumab and docetaxel (Blueteq) MBC",76
RXR,RXR,C900,,,9,Daratumumab,,1800,,2022-07-26,05,2,Daratumumab s/c monotherapy  (NICE - Blueteq),2
RXR,RXR,C189,,,9,Fluorouracil,3127006,5000,,2022-07-12,02; 05,2,Oxaliplatin and modified de Gramont (FOLFOX) - Metastatic Colorectal cancer,28
RXR,RXR,C189,,,9,Capecitabine,108761006,1300,,2022-04-07,98,2,Capecitabine - Adjuvant Colorectal/biliary tract Cancer,2
RXR,RXR,C90X,,,9,Lenalidomide,421737001,7.5,,2022-05-19,05,2,Lenalidomide and Dexamethasone (NICE - Blueteq),5
RXR,RXR,C859,,,9,Cyclophosphamide,74470007,600,,2022-08-04,05,2,R-CHOP 21,4
RXR,RXR,C349,,,9,Pembrolizumab (Keytruda),,200,,2022-07-25,02; 03; 05,2,"Pembrolizumab, carboplatin and pemetrexed (CDF Blueteq)",12
RXR,RXR,C189,,,9,Irinotecan,108783005,300,,2022-06-14,02; 05,2,Irinotecan and modified de Gramont,1
RXR,RXR,C56,,,9,Gemcitabine,108811008,1800,,2022-04-19,02; 03; 04; 05,2,Gemcitabine ovary 4-weekly cycle,2
RXR,RXR,C189,,,9,Capecitabine,108761006,1300,,2022-04-28,98,2,Capecitabine - Adjuvant Colorectal/biliary tract Cancer,3
RXR,RXR,C249,,,9,Gemcitabine,108811008,1800,,2022-06-28,05,2,Cisplatin & Gemcitabine for Biliary Tract,5
RXR,RXR,C90X,,,9,Bortezomib,398907002,2.75,,2022-06-13,05,2,DVTd (Daratumumab sc+Bortezomib+Thalidomide+Dexamethasone) (NICE - Blueteq),2
RXR,RXR,C349,,,9,Atezolizumab (Tecentriq),,1200,,2022-04-05,02; 05,2,Etoposide/Carboplatin/Atezolizumab (Blueteq),42
RXR,RXR,C64,,,9,Avelumab (Bavencio),,800,,2022-08-17,01,2,Axitinib Avelumab (Blueteq),23
RXR,RXR,C20X,,,9,Oxaliplatin,327032007,165,,2022-08-19,04; 05,2,Oxaliplatin and modified de Gramont (FOLFOX) - Metastatic Colorectal cancer,8
RXR,RXR,C349,,,9,Alectinib ,,600,,2022-06-01,02; 03; 05,2,Alectinib (NICE Blueteq),4
RXR,RXR,D471,,,1,Hydroxycarbamide,56602009,1000,,2022-05-02,99,2,Hydroxycarbamide Flexible dose,45
RXR,RXR,C56X,,,9,Paclitaxel,67735003,108,,2022-08-03,98,2,3-Weekly Carboplatin/weekly paclitaxel,4
RXR,RXR,C20X,,,1,Capecitabine,108761006,1300,,2022-07-15,98,2,Oxaliplatin plus oral Capecitabine (CAPOX 3-weekly adjuvant),4
RXR,RXR,C504,,,9,Abemaciclib,,150,,2022-08-16,02; 03; 04; 05,2,Abemaciclib metastatic (Blueteq),5
RXR,RXR,C504,,,9,Fulvestrant,404845006,500,,2022-05-03,02; 03; 04; 05,2,Fulvestrant - MBC,9
RXR,RXR,D469,,,9,Azacitidine,412329008,150,,2022-04-13,99,2,Azacitidine (7 Day),26
RXR,RXR,C189,,,9,Fluorouracil,3127006,800,,2022-08-23,02; 05,2,Irinotecan and modified de Gramont,1
RXR,RXR,C509,,,2,Docetaxel,108806006,120,,2022-07-15,01,2,"Trastuzumab, Pertuzumab Docetaxel",5
RXR,RXR,C509,,,9,Fulvestrant,404845006,500,,2022-05-16,02; 03; 04; 05,2,Fulvestrant - MBC,1
RXR,RXR,C921,,,9,Imatinib,391634008,400,,2022-08-24,99,2,Imatinib (CML-Chronic phase),56
RXR,RXR,C509,,,1,Trastuzumab-Emtansine (Kadcyla),327397006,240,,2022-08-16,98,2,Trastuzumab Emtansine (Kadcyla) - adjuvant (Blueteq),9
RXR,RXR,D473,,,1,Hydroxycarbamide,56602009,500,,2022-08-01,99,2,Hydroxycarbamide Flexible dose,29
RXR,RXR,C509,,,1,Cyclophosphamide,74470007,800,,2022-07-25,98,2,Docetaxel and cyclophosphamide - EBC Adjuvant,3
RXR,RXR,C880,,,9,Rituximab (Truxima),,700,,2022-07-27,98,2,DexRC,5
RXR,RXR,C349,,,9,Carboplatin,108759002,360,,2022-07-01,05,2,Carboplatin Paclitaxel Pembrolizumab NSCLC (Blueteq),3
RXR,RXR,C504,,,9,Vinorelbine,108792008,110,,2022-08-10,02; 03; 04; 05,2,Capecitabine and Vinorelbine,1
RXR,RXR,C182,,,9,Oxaliplatin,327032007,165,,2022-07-15,02; 03; 05,2,Oxaliplatin and modified de Gramont (FOLFOX) - Metastatic Colorectal cancer,2
RXR,RXR,C859,,,9,Doxorubicin,68444001,100,,2022-05-25,98,2,R-CHOP 21,1
RXR,RXR,C61X,,,9,Apalutamide,,240,,2022-07-11,05,2,Apalutamide (Blueteq),5
RXR,RXR,C189,,,9,Cetuximab (Erbitux),409401002,800,,2022-08-02,04; 05,2,Cetuximab colorectal (NICE Blueteq),16
RXR,RXR,C182,81402,,9,Fluorouracil,3127006,3950,,2022-06-29,02; 04; 05,2,Irinotecan and modified de Gramont,1
RXR,RXR,C160,,,9,Capecitabine,108761006,600,,2022-05-31,04,2,"OX Upper GI (Oxaliplatin, capecitabine)",6
RXR,RXR,C349,,,9,Pembrolizumab (Keytruda),,400,,2022-04-12,02,2,Pembrolizumab Metastatic (6 weekly) (Blueteq),14
RXR,RXR,C186,,,9,Fluorouracil,3127006,650,,2022-08-09,02; 04; 05,2,Irinotecan and modified de Gramont,19
RXR,RXR,C189,,,9,Fluorouracil,3127006,800,,2022-08-10,02; 05,2,Irinotecan and modified de Gramont,4
RXR,RXR,C189,,,9,Oxaliplatin,327032007,165,,2022-04-20,02; 05,2,Oxaliplatin and modified de Gramont (FOLFOX) - Metastatic Colorectal cancer,12
RXR,RXR,D471,,,1,Hydroxycarbamide,56602009,500,,2022-06-06,99,2,Hydroxycarbamide Flexible dose,44
RXR,RXR,C189,,,9,Encorafenib,,300,,2022-07-04,02,2,Encorafenib and cetuximab (CDF - Blueteq),1
RXR,RXR,C187,81402,,9,Fluorouracil,3127006,550,,2022-07-20,02; 04; 05,2,Irinotecan and modified de Gramont,17
RXR,RXR,C182,,,9,Oxaliplatin,327032007,250,,2022-05-16,02; 05,2,Oxaliplatin plus oral Capecitabine (CAPOX 3 weekly),2
RXR,RXR,C349,,,9,Etoposide,56928005,148,,2022-07-07,02; 03; 05,2,Etoposide IV/Carboplatin,1
RXR,RXR,C349,,,9,Pembrolizumab (Keytruda),,200,,2022-08-19,02; 05,2,Pembrolizumab Metastatic (3 weekly) (Blueteq),8
RXR,RXR,C649,,,9,Avelumab (Bavencio),,800,,2022-04-26,05,2,Axitinib Avelumab (Blueteq),5
RXR,RXR,C921,,,9,Imatinib,391634008,400,,2022-04-07,99,2,Imatinib (CML-Chronic phase),15
RXR,RXR,C182,81402,,9,Fluorouracil,3127006,3950,,2022-06-10,05,2,Irinotecan and modified de Gramont,49
RXR,RXR,C64,,,9,Cabozantinib,28013211000001109,40,,2022-06-17,04,2,Cabozantinib (NICE Blueteq),3
RXR,RXR,C61X,,,9,Apalutamide,,240,,2022-05-24,05,2,Apalutamide (Blueteq),4
RXR,RXR,C504,,,9,Capecitabine,108761006,800,,2022-08-30,02; 03; 04; 05,2,Capecitabine and Vinorelbine,5
RXR,RXR,C349,,,9,Pembrolizumab (Keytruda),,200,,2022-04-11,02; 03; 05,2,Carboplatin Paclitaxel Pembrolizumab NSCLC (Blueteq),1
RXR,RXR,C349,,,9,Pembrolizumab (Keytruda),,200,,2022-08-19,02; 03; 05,2,Carboplatin Paclitaxel Pembrolizumab NSCLC (Blueteq),7
RXR,RXR,C61X,,,9,Apalutamide,,240,,2022-04-18,05,2,Apalutamide (Blueteq),2
RXR,RXR,D471,,,1,Ruxolitinib,703779004,10,,2022-05-30,99,2,Ruxolitinib,22
RXR,RXR,C349,,,9,Atezolizumab (Tecentriq),,1200,,2022-07-07,02; 03; 05,2,Etoposide/Carboplatin/Atezolizumab (Blueteq),1
RXR,RXR,C64,,,9,Cabozantinib,28013211000001109,40,,2022-06-10,05,2,Cabozantinib (NICE Blueteq),1
RXR,RXR,C259,,,9,Gemcitabine,108811008,1800,,2022-05-23,04,2,Gemcitabine (metastatic pancreatic),1
RXR,RXR,C349,,,9,Carboplatin,108759002,450,,2022-05-11,05,2,Carboplatin Paclitaxel Pembrolizumab NSCLC (Blueteq),2
RXR,RXR,C509,,,2,Paclitaxel,67735003,132,,2022-04-21,98,2,Carboplatin paclitaxel - EC,1
RXR,RXR,C911,,,9,Obinutuzumab (Gazyvaro) ,25502511000001105,1000,,2022-06-16,,2,Venetoclax+Obinutuzumab [Blueteq],1
RXR,RXR,C509,,,9,Fulvestrant,404845006,500,,2022-07-22,05,2,Fulvestrant - MBC,36
RXR,RXR,C187,,,9,Fluorouracil,3127006,800,,2022-07-15,02; 05,2,Irinotecan and modified de Gramont,14
RXR,RXR,C509,,,2,Carboplatin,108759002,630,,2022-08-16,98,2,Carboplatin paclitaxel - EC,4
RXR,RXR,C160,,,9,Oxaliplatin,327032007,100,,2022-04-13,01,2,"FLOT (5FU, Folinic acid, Oxaliplatin, Docetaxel)",3
RXR,RXR,C259,,,9,Nab-Paclitaxel (Abraxane),20176411000001103,140,,2022-08-10,04,2,Nab-Paclitaxel & Gemcitabine (NICE - Blueteq),5
RXR,RXR,C187,81402,,9,Irinotecan,108783005,270,,2022-06-22,02; 04; 05,2,Irinotecan and modified de Gramont,15
RXR,RXR,C90X,,,9,Panobinostat ,429398005,20,,2022-07-19,04,2,Panobinostat - Bortezomib - Dexamethasone (FVD),3
RXR,RXR,C501,,,9,Enhertu (Trastuzumab Deruxtecan),,440,,2022-05-16,02; 03; 04; 05,2,Trastuzumab Deruxtecan,1
RXR,RXR,C160,,,9,Capecitabine,108761006,1300,,2022-07-29,02; 03; 05,2,"OX Upper GI (Oxaliplatin, capecitabine)",1
RXR,RXR,C508,,,9,Pertuzumab (Perjeta),704227006,420,,2022-04-26,05,2,"Trastuzumab, pertuzumab and docetaxel (Blueteq) MBC",145
RXR,RXR,C509,,,2,Cyclophosphamide,74470007,650,,2022-07-07,01,2,EC,2
RXR,RXR,C160,,,9,Fluorouracil,3127006,3500,,2022-04-13,01,2,"FLOT (5FU, Folinic acid, Oxaliplatin, Docetaxel)",3
RXR,RXR,C349,,,9,Pembrolizumab (Keytruda),,200,,2022-07-27,02; 05,2,Pembrolizumab Metastatic (3 weekly) (Blueteq),6
RXR,RXR,C90X,,,9,Lenalidomide,421737001,5,,2022-08-08,05,2,Lenalidomide maintenance [Blueteq],6
RXR,RXR,C859,,,9,Capecitabine,108761006,1150,,2022-04-27,98,2,Capecitabine - Adjuvant Colorectal/biliary tract Cancer,1
RXR,RXR,C504,,,2,Pertuzumab 600mg and Trastuzumab 600mg in 10ml,,10,,2022-08-03,04,2,"Trastuzumab, pertuzumab SC Maintenance",16
RXR,RXR,C259,,,1,Gemcitabine,108811008,1400,,2022-08-25,99,2,Gemcitabine Capecitabine Adjuvant Pancreatic,1
RXR,RXR,D471,,,1,Hydroxycarbamide,56602009,500,,2022-08-15,99,2,Hydroxycarbamide Flexible dose,40
RXR,RXR,C541,,,9,Paclitaxel,67735003,108,,2022-06-08,02; 04,2,3-Weekly Carboplatin/weekly paclitaxel,6
RXR,RXR,C509,,,1,Docetaxel,108806006,80,,2022-08-24,98,2,Docetaxel and cyclophosphamide - EBC Adjuvant,1
RXR,RXR,C349,,,9,Pemetrexed,411089001,650,,2022-08-11,02; 05,2,"Pembrolizumab, carboplatin and pemetrexed (CDF Blueteq)",4
RXR,RXR,C20X,,,9,Fluorouracil,3127006,4450,,2022-06-08,98,2,Oxaliplatin and modified de Gramont (FOLFOX) - Metastatic Colorectal cancer,14
RXR,RXR,C833,,,9,Rituximab (Truxima),,600,,2022-08-11,98,2,R-CHOP 21,8
RXR,RXR,C189,,,9,Fluorouracil,3127006,3500,,2022-08-19,02; 05,2,Irinotecan and modified de Gramont,11
RXR,RXR,C541,,,9,Paclitaxel,67735003,162,,2022-06-01,02; 03; 04; 05,2,3-Weekly Carboplatin/weekly paclitaxel,3
RXR,RXR,C160,,,9,Docetaxel,108806006,88,,2022-04-13,01,2,"FLOT (5FU, Folinic acid, Oxaliplatin, Docetaxel)",6
RXR,RXR,D473,,,1,Hydroxycarbamide,56602009,500,,2022-04-25,99,2,Hydroxycarbamide Flexible dose,38
RXR,RXR,C20X,,,9,Fluorouracil,3127006,4450,,2022-04-26,98,2,Oxaliplatin and modified de Gramont (FOLFOX) - Metastatic Colorectal cancer,12
RXR,RXR,C349,,,9,Paclitaxel,67735003,120,,2022-05-16,02; 05,2,3-Weekly Carboplatin/weekly paclitaxel,4
RXR,RXR,C509,,,2,Paclitaxel,67735003,144,,2022-06-30,98,2,Carboplatin paclitaxel - EC,4
RXR,RXR,C502,,,9,Denosumab (Xgeva),,120,,2022-07-18,05,2,Denosumab,42
RXR,RXR,D469,,,9,Isatuximab,,900,,2022-04-20,05,2,Isatuximab + Pomalidomide + Dexamethasone [Blueteq],14
RXR,RXR,C349,,,9,Carboplatin,108759002,700,,2022-06-21,02; 05,2,"Pembrolizumab, carboplatin and pemetrexed (CDF Blueteq)",1
RXR,RXR,C459,,,9,Pemetrexed,411089001,750,,2022-06-13,02; 03; 04; 05,2,Pemetrexed and Carboplatin,5
RXR,RXR,C501,,,9,Sacituzumab Govitecan,,720,,2022-04-25,02; 03; 04; 05,2,Sacituzumab Govitecan (EAMS),2
RXR,RXR,C90X,,,9,Lenalidomide,421737001,25,,2022-07-07,98,2,Carfilzomib-Lenalidomide-Dexamethasone [Blueteq],4
RXR,RXR,C679,,,1,Carboplatin,108759002,400,,2022-06-21,04,2,Gemcitabine and Carboplatin (Bladder),3
RXR,RXR,C189,,,9,Cetuximab (Erbitux),409401002,1000,,2022-05-04,02; 03; 04; 05; 98,2,Cetuximab colorectal (NICE Blueteq),9
RXR,RXR,C509,,,2,Paclitaxel,67735003,144,,2022-05-27,98,2,Carboplatin paclitaxel - EC,2
RXR,RXR,E859,,,9,Bortezomib,398907002,1.6,,2022-06-22,05,2,Low dose Cyclophosphamide - Bortezomib - Dexamethasone,1
RXR,RXR,E859,,,9,Bortezomib,398907002,1.8,,2022-08-03,05,2,Low dose Cyclophosphamide - Bortezomib - Dexamethasone,2
RXR,RXR,C502,,,9,Vinorelbine,108792008,80,,2022-07-20,02; 03; 04; 05,2,Capecitabine and Vinorelbine,4
RXR,RXR,C509,,,9,Palbociclib (Ibrance),,100,,2022-05-12,02; 03; 04; 05,2,Palbociclib (NICE Blueteq),30
RXR,RXR,C341,,,9,Etoposide,56928005,200,,2022-06-24,02; 03; 05,2,Etoposide IV/Carboplatin,1
RXR,RXR,C509,,,2,Paclitaxel,67735003,144,,2022-07-25,98,2,Carboplatin paclitaxel - EC,2
RXR,RXR,C509,,,1,Trastuzumab-Emtansine (Kadcyla),327397006,180,,2022-06-14,98,2,Trastuzumab Emtansine (Kadcyla) - adjuvant (Blueteq),8
RXR,RXR,C90X,,,9,Carfilzomib,714783001,48,,2022-05-13,98,2,Carfilzomib-Lenalidomide-Dexamethasone [Blueteq],2
RXR,RXR,C859,,,9,Rituximab (MabThera),108809004,1400,,2022-07-19,98,2,Subcutaneous Rituximab (MabThera) Maintenance (8 weekly),3